BDBM15386 3-(5-chloro-2,4-dihydroxyphenyl)-N-phenyl-1H-pyrazole-4-carboxamide::3-(5-chloro-2,4-dihydroxyphenyl)-pyrazole-4-carboxamide 14a
SMILES Oc1cc(O)c(cc1Cl)-c1n[nH]cc1C(=O)Nc1ccccc1
InChI Key InChIKey=DKSYLXZOIPJWAM-UHFFFAOYSA-N
Data  1 IC50
  Tab Delimited (TSV)   2D SDfile   Computed 3D by Vconf -m prep SDfile
Find this compound or compounds like it in BindingDB:
Activity Spreadsheet -- Enzyme Inhibition Constant Data from BindingDB
Found 1 hit for monomerid = 15386
TargetHeat shock protein HSP 90-beta(Homo sapiens (Human))
Vernalis (R&D)
LigandPNGBDBM15386(3-(5-chloro-2,4-dihydroxyphenyl)-N-phenyl-1H-pyraz...)
Affinity DataIC50:  7.10E+3nMpH: 7.4 T: 2°C. Assay description: The assay is based upon displacement of a fluorescently labeled molecule, which binds specifically to the ATP-binding site of full-length human Hsp90...
In DepthDetails ArticlePubMed